{"text_format":"1","workbook":"xlsx","n_sheets":16,"sheets":["Resgate","Atropelamento","Avistamentos","Hymenoptera","Geral","Quadros_resgates","Hist. Result (2)","at-km","Graf_1","GRAF-2(3)","Geral_antigão","Graf_2","Graf_2b","Treinamento","Quad","Decreto"],"not_rendered":{"charts":22,"images":7,"macros":1,"external_links":0,"defined_names":9,"comments":0,"pivot_tables":57},"unopened":[],"bounds":{"document_bytes":16777216,"sheet_cells":100000,"rows_first":2000,"rows_last":500,"rows_between":2000,"halvings":0,"cell_chars":16384,"cell_head_chars":4096},"cells_cut":0,"cells_raw":0,"read":"whole","date_system":"1900"}

{"sheet":"Resgate","index":0,"n_rows":177,"n_cols":27,"rows_kept":177,"cut":false,"hidden":false,"merged":[]}
["ID","Tipo ","Data","Hora do Registro","Identificação do Local","Resgate_X","Resgate_Y","Fitofisionomia/ Ambiente","Condição Meteorológica","NÚMERO DE INDIVÍDUOS","GRUPO","ORDEM","FAMÍLIA","Nome científico","Nome popular","Cond. do Animal","Base de Fauna","Estágio de desenvolvimento (no resgate)","Sexo","Acidentada em decorrência da obra","Quarentena","Destino","Data de destinação","Soltura_X","Soltura_Y","Espécies categorizadas pelo Decreto 63.853/2018","Informações adicionais"]
[1,"RE","2020-08-13","13:10:00","Canteiro de Apoio",308210,7490892,"Campo Antrópico","Ensolarado",1,"HERPETOFAUNA","Squamata","Dipsadidae","Oxyrhopus guibei","Falsa-coral","Saudável","Sim","Adulto","Fêmea","Não","Não","Soltura","2020-08-13",310715,7492902,"Não","-"]
[2,"RE","2020-08-14","15:05:00","Canteiro de Apoio",308529,7491337,"Campo Antrópico","Ensolarado",1,"HERPETOFAUNA","Squamata","Colubridae","Philodryas olfersii","Cobra-verde","Saudável","Sim","Adulto","Macho","Não","Não","Soltura","2020-08-14",310719,7492752,"Não","-"]
[3,"RE","2020-08-24","16:49:00","Canteiro de Apoio",307556,7490619,"Campo Antrópico","Ensolarado",1,"HERPETOFAUNA","Squamata","Mabuydae","Copeoglossum nigropunctatum","Calango-cobra","Ferido","Sim","Adulto","ND","Sim","Sim","Soltura","2020-08-25",310917,7492652,"Não","-"]
["-","AF","2020-08-20","-","ASV - Área 17",307474,7490683,"Fragmento Florestal","Ensolarado",1,"MASTOFAUNA","Primata","Cebidae","Calitrix pericilatta","Sagui Tufo Preto","Saudável","Não","Adulto","ND","Não","Não","-","-","-","-","-","-"]
["-","AF","2020-08-24","-","ASV - Área 07",307564,7490497,"Fragmento Florestal","Ensolarado",1,"HERPETOFAUNA","Squamata","Teiidae","Salvator merianae","Teiú","Saudável","Não","Adulto","ND","Não","Não","-","-","-","-","-","-"]
{"$rows_left_out":172}
{"sheet":"Atropelamento","index":1,"n_rows":27,"n_cols":33,"rows_kept":27,"cut":false,"hidden":false,"merged":[[0,0,1,24]]}
["REGISTROS DOS RESGATES"]
[]
["ID","Ocorrência","ANO","Mês","Data","Hora","Características da Via","Características do Entorno","Rodovia","km","Sentido","UTM-X","UTM-Y","Fuso ","Classificação","Grupo","Nome científico","Popular","Quantidade","Situação do animal","Destinação","UTM - X","UTM - Y","Fuso ","Observações","Data de Destinação","Ano da Destinação","Mês da Destinação",null,null,"clima","Base de Fauna","Acidentada em decorrência da obra"]
[4,"AT",{"$f":"YEAR(E4)","v":2020},{"$f":"MONTH(E4)","v":8},"2020-08-26","15:56:00","Plano","Fragento Florestal","-","-","-",309035,7490950,23,"Silvestre","HERPETOFAUNA","Dipsas mikanii","Jararaquinha-dormideira",1,"Morto","UNIFAJ",292726,7486121,23,"UNIFAJ - 02/11/2020","2020-12-01",2020,12]
[5,"AT",{"$f":"YEAR(E5)","v":2020},{"$f":"MONTH(E5)","v":9},"2020-09-12","07:00:00","Declive / Curva","Fragento Florestal","SP-107","02","oeste",308165,7487924,23,"Silvestre","MASTOFAUNA","Didelphis albiventris","Gambá-de-orelha-branca",1,"Morto","UNIFAJ",292726,7486121,23,"UNIFAJ - 02/11/2020","2020-12-01",2020,12]
[6,"AT",2020,9,"2020-09-12","08:25:00","Plano","Outro","-","-","-",307809,7490564,23,"Silvestre","HERPETOFAUNA","Oxyrhopus guibei","Falsa- coral",1,"Morto","UNIFAJ",292726,7486121,23,"UNIFAJ - 02/11/2020","2020-12-01",2020,12]
{"$rows_left_out":22}
{"sheet":"Avistamentos","index":2,"n_rows":119,"n_cols":31,"rows_kept":119,"cut":false,"hidden":false,"merged":[]}
[null,"MONITORAMENTO/MANEJO DE FAUNA EM RODOVIAS"]
[null,null,null,null,null,null,null,null,null,null,null,"Coordenadas Geográficas (UTM) Resgate",null,null,"Identificação taxônomica ",null,null,null,"Detalhamento da fauna impactada",null,null,"Coordenadas Geográficas (UTM) destino",null,null,null,null,null,null,"Familia","ordem"]
["ID","Ocorrência","ANO","Mês","Data","Hora","Características da Via","Características do Entorno","Rodovia","km","Sentido","UTM-X","UTM-Y","Fuso ","Classificação","Grupo","Nome científico","Popular","Quantidade","Situação do animal","Destinação","UTM - X","UTM - Y","Fuso ","Observações","Data de Destinação","Ano da Destinação","Mês da Destinação",null,null,"clima"]
["-","AV",2020,8,"2020-08-24","14:12:00","-","Pastagem","-","-","-",308243,7491146,23,"Silvestre","AVIFAUNA","Megaceryle torquata","Martinho-Pescador-Grande",1,"Saudável","-","-","-","-","-","-","-","-"]
["-","AV",2020,8,"2020-08-24","14:14:00","-","Pastagem","-","-","-",308370,7491419,23,"Silvestre","AVIFAUNA","Nannopterum brasilianus","Biguá",1,"Saudável","-","-","-","-","-","-","-","-"]
["-","AV",2020,8,"2020-08-24","14:14:00","-","Pastagem","-","-","-",308370,7491419,23,"Silvestre","MASTOFAUNA","Hydrochoerus hydrochaeris","Capivara ",1,"Saudável","-","-","-","-","-","-","-","-"]
{"$rows_left_out":114}
{"sheet":"Hymenoptera","index":3,"n_rows":4,"n_cols":18,"rows_kept":4,"cut":false,"hidden":false,"merged":[[0,1,0,5],[0,6,0,10],[0,11,0,13]]}
["REGISTRO","DETALHAMENTO DA ORIGEM/REGISTRO DE OCORRÊNCIA",null,null,null,null,"IDENTIFICAÇÃO TAXONÔMICA",null,null,null,null,"DETALHAMENTO DA REALOCAÇÃO"]
["ID","Data","Identificação do Local","Coordenada\nResgate\nX","Coordenada\nResgate\nY","NÚMERO DE INDIVÍDUOS","GRUPO","ORDEM","FAMÍLIA","Nome científico","Nome popular","Data de destinação","Coordenada \nSoltura\nX","Coordenada\nSoltura\nY"]
[1,"2020-09-05","Área 23",307460,7490920,1,"Meliponinae ","Hymenoptera","Apidae ","Tetragonisca angustula","Jataí","2020-09-19",310854,7492634,null,null,"Nome científico","Contagem de Nome científico"]
[null,null,null,null,null,null,null,null,null,null,null,null,null,null,null,null,"Tetragonisca angustula",1]

{"sheet":"Geral","index":4,"n_rows":210,"n_cols":121,"rows_kept":210,"cut":false,"hidden":false,"merged":[[26,36,26,55],[26,57,26,76],[28,6,28,7],[28,8,28,15],[28,4,28,5],[5,0,5,2],[7,0,7,2],[8,0,9,0],[12,0,12,2],[23,0,23,2],[30,119,31,122],[222,6,222,32],[29,0,29,2],[31,0,31,2],[28,93,28,113],[28,78,28,91],[28,16,28,20],[28,21,28,30],[28,31,28,32]]}
["Verificação de erros:","MÊS DE INTERESSE",5]
[{"$f":"IF(B21+B22=B23,\"OK\",\"algo errado, vc levará um puxar de orelha da carol\")","v":"algo errado, vc levará um puxar de orelha da carol"},"ANO DE INTERESSE",2021]
[null,"HOJE",{"$f":"TODAY()","v":"2023-08-04"}]
["Quadro 4 - Indicadores","ESSE MÊS",{"$f":"MONTH(C3)","v":8}]
[null,"km rodados no mês",200]
["PROGRAMA DE MONITORAMENTO E CONSERVAÇÃO DA FAUNA"]
{"$rows_left_out":205}
{"sheet":"Quadros_resgates","index":5,"n_rows":16,"n_cols":19,"rows_kept":16,"cut":false,"hidden":false,"merged":[]}
[]
["ID","DATA","NOME CIENTÍFICO","LOCAL DO RESGATE",null,"ID","DATA","NOME CIENTÍFICO","CONDIÇÃO DO ANIMAL","DESTINAÇÃO","OBSERVAÇÃO",null,"ID","DATA","NOME CIENTÍFICO","CARACT. DA VIA","CONDIÇÃO DO ANIMAL","DESTINAÇÃO","OBSERVAÇÃO"]
[75,"2021-05-07","Salvator merianae","Bota fora",null,75,"2021-05-07","Salvator merianae","Saudável","Soltura","-",null,59,"2021-03-02","Crotalus durissus","Estrada de terra ","Morto","Base de Fauna","Descarte - sem aproveitamento científico"]
[76,"2021-05-10","Philodryas olfersii","Industrial",null,76,"2021-05-10","Philodryas olfersii","Saudável","Soltura","-",null,65,"2021-03-18","Tantilla melanocephala","Estrada de terra ","Morto","Base de Fauna","Descarte - sem aproveitamento científico"]
[77,"2021-05-12","Bothrops urutu","Sublote de plantio 7.6",null,77,"2021-05-12","Bothrops urutu","Saudável","Soltura","-"]
[78,"2021-05-13","Bothrops newiedi","ASV - Area 22",null,78,"2021-05-13","Bothrops newiedi","Saudável","Soltura","-"]
{"$rows_left_out":11}
{"sheet":"Hist. Result (2)","index":6,"n_rows":21,"n_cols":26,"rows_kept":21,"cut":false,"hidden":false,"merged":[[2,2,2,3],[2,4,2,5],[2,8,2,9],[2,10,2,11],[2,12,2,13],[2,24,2,25],[1,16,1,25],[2,16,2,17],[2,18,2,19],[2,20,2,21],[2,22,2,23],[1,1,1,15],[2,1,3,1],[18,24,18,25],[18,10,18,11],[18,2,18,3],[18,4,18,5],[18,6,18,7],[18,8,18,9],[18,12,18,13],[18,14,18,15],[18,16,18,17],[18,18,18,19],[18,20,18,21],[18,22,18,23],[2,14,2,15],[2,6,2,7]]}
[null,null,4,4,5,5,"1º Quadrimestre",null,7,7,8,8,9,9,"2º Quadrimestre",null,10,10,11,11,12,12]
[null,"PROGRAMA DE MONITORAMENTO E CONSERVAÇÃO DA FAUNA",null,null,null,null,null,null,null,null,null,null,null,null,null,null,"3º Quadrimestre"]
[null,"Indicador","2020-08-01",null,"2020-09-01",null,"1º Quadrimestre",null,"2020-11-01",null,"2020-12-01",null,"2021-01-01",null,"2º Quadrimestre",null,"2021-02-01",null,"2021-03-01",null,"2021-04-01",null,"2021-05-01",null,"3º Quadrimestre"]
[null,null,"Período","Acumulado","Período","Acumulado","Período","Acumulado","Período","Acumulado","Período","Acumulado","Período","Acumulado","Período","Acumulado","Período","Acumulado","Período","Acumulado","Período","Acumulado","Período","Acumulado","Período","Acumulado"]
[null,"Subprograma de Resgate da Fauna Silvestre"]
[null,"Afugentamento (número aproximado)","3/3","3/3","0/0","3/3","3/3",{"$f":"F6","v":"3/3"},"0/0","3/3","0/0","3/3","0/0","3/3","0/0",{"$f":"N6","v":"3/3"},"0/0","3/3","0/0","3/3","0/0","3/3","0/0","3/3"]
{"$rows_left_out":16}
{"sheet":"at-km","index":7,"n_rows":7,"n_cols":26,"rows_kept":7,"cut":false,"hidden":false,"merged":[[0,14,0,17],[0,18,0,21],[0,0,0,4]]}
["Nº de Atropelamentos",null,null,null,null,null,"dias",null,null,null,null,null,null,null,"1º Quadrimestre",null,null,null,"2º Quadrimestre",null,null,null,"3º Quadrimestre"]
["Mês","1º mês","2º mês","3º mês","4º mês","TOTAL","Nº de Campanhas","Kilometragem monitorada","Média Nº Atrop. / km","Nº de Profissionais","Esforço amostral",null,null,"Mês","2020-06-01","2020-07-01","2020-08-01","2020-09-01","2020-10-01","2020-11-01","2020-12-01","2021-01-01","2021-02-01","2021-03-01","2021-04-01","2021-05-01"]
["1º Quadrimestre",0,0,1,1,{"$f":"SUM(B3:E3)","v":2},3,{"$f":"G3*100","v":300},{"$f":"F3/H3","v":6.6666666666666671E-3},{"$f":"G3*2","v":6},{"$f":"J3*G3*4/2","v":36},null,null,"Nº de Atropelamentos (campanha de monitoramento)",0,0,1,1,0,3,0,0,0,0,0,0]
["2º Quadrimestre",0,3,0,0,{"$f":"SUM(B4:E4)","v":3},5,{"$f":"G4*100","v":500},{"$f":"F4/H4","v":6.0000000000000001E-3},{"$f":"G4*2","v":10},{"$f":"J4*G4*4/2","v":100},null,null,"Nº de Campanhas",0,0,1,2,0,1,2,2,2,2,2,2]
["3º Quadrimestre",0,0,0,0,{"$f":"SUM(B5:E5)","v":0},4,{"$f":"G5*100","v":400},{"$f":"F5/H5","v":0},{"$f":"G5*2","v":8},{"$f":"J5*G5*4/2","v":64},null,null,"Kilometragem Monitorada",{"$f":"O4*100","v":0},{"$f":"P4*100","v":0},100,200,0,100,200,200,200,{"$f":"X4*100","v":200},{"$f":"Y4*100","v":200},{"$f":"Z4*100","v":200}]
["Total",{"$f":"SUM(B3:B4)","v":0},3,1,1,{"$f":"SUM(B6:E6)","v":5},8,800,{"$f":"F6/H6","v":6.2500000000000003E-3},{"$f":"SUM(J3:J4)","v":16},{"$f":"SUM(K3:K4)","v":136},null,null,"Número de registros por km percorrido",{"$f":"IFERROR(ROUND(O3/O5,4),\"-\")","v":"-"},{"$f":"IFERROR(ROUND(P3/P5,4),\"-\")","v":"-"},0.01,5.0000000000000001E-3,"-",0.03,0,0,0,{"$f":"IFERROR(ROUND(X3/X5,4),\"-\")","v":0},{"$f":"IFERROR(ROUND(Y3/Y5,4),\"-\")","v":0},{"$f":"IFERROR(ROUND(Z3/Z5,4),\"-\")","v":0}]
{"$rows_left_out":2}
{"sheet":"Graf_1","index":8,"n_rows":10,"n_cols":3,"rows_kept":10,"cut":false,"hidden":false,"merged":[]}
[{"$f":"Geral!CR19","v":"Tipo "},{"$f":"Geral!CS19","v":"GRUPO"},{"$f":"Geral!CT19","v":"Contagem de Nome científico"}]
[{"$f":"Geral!CR20","v":"AF"},{"$f":"Geral!CS20","v":"AVIFAUNA"},{"$f":"Geral!CT20","v":0}]
[{"$f":"Geral!CR21","v":"AF"},{"$f":"Geral!CS21","v":"HERPETOFAUNA"},{"$f":"Geral!CT21","v":0}]
[{"$f":"Geral!CR22","v":"AF"},{"$f":"Geral!CS22","v":"MASTOFAUNA"},{"$f":"Geral!CT22","v":0}]
[{"$f":"Geral!CR23","v":"AT"},{"$f":"Geral!CS23","v":"AVIFAUNA"},{"$f":"Geral!CT23","v":0}]
[{"$f":"Geral!CR24","v":"AT"},{"$f":"Geral!CS24","v":"HERPETOFAUNA"},0]
{"$rows_left_out":5}
{"sheet":"GRAF-2(3)","index":9,"n_rows":44,"n_cols":2,"rows_kept":44,"cut":false,"hidden":false,"merged":[]}
["Nome científico","Contagem de Nome científico"]
["Crotalus durissus",42]
["Bothrops newiedi",7]
["Dipsas mikanii",12]
["Oxyrhopus guibei",12]
["Amphisbaena alba",7]
{"$rows_left_out":39}
{"sheet":"Geral_antigão","index":10,"n_rows":210,"n_cols":244,"rows_kept":210,"cut":false,"hidden":false,"merged":[[222,6,222,32],[26,140,26,147],[28,21,28,30],[28,31,28,32],[5,0,5,2],[7,0,7,2],[12,0,12,2],[23,0,23,2],[28,4,28,5],[8,0,9,0],[28,6,28,7],[28,8,28,15],[28,16,28,20],[0,185,0,187],[26,149,26,156],[26,158,26,165],[26,167,26,174],[26,176,26,183]]}
["Verificação de erros:","MÊS DE INTERESSE",null,null,null,1,null,null,null,null,null,null,null,null,null,null,null,null,null,null,null,null,null,null,null,null,null,null,null,null,null,null,null,null,null,null,null,null,null,null,null,null,null,null,null,null,null,null,null,null,null,null,null,null,null,null,null,null,null,null,null,null,null,null,null,null,null,null,null,null,null,null,null,null,null,null,null,null,null,null,null,null,null,null,null,null,null,null,null,null,null,null,null,"AVIFAUNA","HERPETOFAUNA",null,"MASTOFAUNA",null,null,null,null,null,null,null,null,null,null,null,null,null,null,null,null,null,null,null,null,null,null,null,null,null,null,null,null,null,null,null,null,null,null,null,null,null,null,null,null,null,null,null,null,null,null,null,null,null,null,null,null,null,null,null,null,null,null,null,null,null,null,null,null,null,null,null,null,null,null,null,null,null,null,null,null,null,null,null,null,null,null,null,null,null,null,null,null,"ATROPELAMENTO AO LONGO DO TEMPO"]
[{"$f":"IF(B21+B22=B23,\"OK\",\"algo errado, vc levará um puxar de orelha da carol\")","v":"algo errado, vc levará um puxar de orelha da carol"},"ANO DE INTERESSE",null,null,null,2021,null,null,null,null,null,null,null,null,null,null,null,null,null,null,null,null,null,null,null,null,null,null,null,null,null,null,null,null,null,null,null,null,null,null,null,null,null,null,null,null,null,null,null,null,null,null,null,null,null,null,null,null,null,null,null,null,null,null,null,null,null,null,null,null,null,null,null,null,null,null,null,null,null,null,null,null,null,null,null,null,null,null,null,null,null,null,"regionalmente extinta",null,null,null,null,null,null,null,null,null,null,null,null,null,null,null,null,null,null,null,null,null,null,null,null,null,null,null,null,null,null,null,null,null,null,null,null,null,null,null,null,null,null,null,null,null,null,null,null,null,null,null,null,null,null,null,null,null,null,null,null,null,null,null,null,null,null,null,null,null,null,null,null,null,null,null,null,null,null,null,null,null,null,null,null,null,null,null,null,null,null,null,null,"DATA","S - Riqueza","n - nº de Indivíduos"]
[null,"HOJE",{"$f":"TODAY()","v":"2023-08-04"},null,null,null,null,null,null,null,null,null,null,null,null,null,null,null,null,null,null,null,null,null,null,null,null,null,null,null,null,null,null,null,null,null,null,null,null,null,null,null,null,null,null,null,null,null,null,null,null,null,null,null,null,null,null,null,null,null,null,null,null,null,null,null,null,null,null,null,null,null,null,null,null,null,null,null,null,null,null,null,null,null,null,null,null,null,null,null,null,null,"criticamente em perigo",null,null,null,null,null,null,null,null,null,null,null,null,null,null,null,null,null,null,null,null,null,null,null,null,null,null,null,null,null,null,null,null,null,null,null,null,null,null,null,null,null,null,null,null,null,null,null,null,null,null,null,null,null,null,null,null,null,null,null,null,null,null,null,null,null,null,null,null,null,null,null,null,null,null,null,null,null,null,null,null,null,null,null,null,null,null,null,null,null,null,null,null,"2020-08-01",{"$f":"GE24","v":1},{"$f":"GF24","v":1}]
["Quadro 4 - Indicadores","ESSE MÊS",{"$f":"MONTH(C3)","v":8},null,null,null,null,null,null,null,null,null,null,null,null,null,null,null,null,null,null,null,null,null,null,null,null,null,null,null,null,null,null,null,null,null,null,null,null,null,null,null,null,null,null,null,null,null,null,null,null,null,null,null,null,null,null,null,null,null,null,null,null,null,null,null,null,null,null,null,null,null,null,null,null,null,null,null,null,null,null,null,null,null,null,null,null,null,null,null,null,null,"em perigo",null,null,null,null,null,null,null,null,null,null,null,null,null,null,null,null,null,null,null,null,null,null,null,null,null,null,null,null,null,null,null,null,null,null,null,null,null,null,null,null,null,null,null,null,null,null,null,null,null,null,null,null,null,null,null,null,null,null,null,null,null,null,null,null,null,null,null,null,null,null,null,null,null,null,null,null,null,null,null,null,null,null,null,null,null,null,null,null,null,null,null,null,"2020-09-01",{"$f":"GO24","v":6},{"$f":"GP24","v":8}]
[null,"km rodados no mês",null,null,null,100,null,null,null,null,null,null,null,null,null,null,null,null,null,null,null,null,null,null,null,null,null,null,null,null,null,null,null,null,null,null,null,null,null,null,null,null,null,null,null,null,null,null,null,null,null,null,null,null,null,null,null,null,null,null,null,null,null,null,null,null,null,null,null,null,null,null,null,null,null,null,null,null,null,null,null,null,null,null,null,null,null,null,null,null,null,null,"vulnerável",null,null,null,null,null,null,null,null,null,null,null,null,null,null,null,null,null,null,null,null,null,null,null,null,null,null,null,null,null,null,null,null,null,null,null,null,null,null,null,null,null,null,null,null,null,null,null,null,null,null,null,null,null,null,null,null,null,null,null,null,null,null,null,null,null,null,null,null,null,null,null,null,null,null,null,null,null,null,null,null,null,null,null,null,null,null,null,null,null,null,null,null,"2020-11-01",{"$f":"GY24","v":3},{"$f":"GZ24","v":3}]
["PROGRAMA DE MONITORAMENTO E CONSERVAÇÃO DA FAUNA",null,null,null,null,null,null,null,null,null,null,null,null,null,null,null,null,null,null,null,null,null,null,null,null,null,null,null,null,null,null,null,null,null,null,null,null,null,null,null,null,null,null,null,null,null,null,null,null,null,null,null,null,null,null,null,null,null,null,null,null,null,null,null,null,null,null,null,null,null,null,null,null,null,null,null,null,null,null,null,null,null,null,null,null,null,null,null,null,null,null,null,"quase ameaçada",null,null,null,null,null,null,null,null,null,null,null,null,null,null,null,null,null,null,null,null,null,null,null,null,null,null,null,null,null,null,null,null,null,null,null,null,null,null,null,null,null,null,null,null,null,null,null,null,null,null,null,null,null,null,null,null,null,null,null,null,null,null,null,null,null,null,null,null,null,null,null,null,null,null,null,null,null,null,null,null,null,null,null,null,null,null,null,null,null,null,null,null,"2020-12-01",{"$f":"HI24","v":1},{"$f":"HJ24","v":1}]
{"$rows_left_out":205}
{"sheet":"Graf_2","index":11,"n_rows":69,"n_cols":35,"rows_kept":69,"cut":false,"hidden":false,"merged":[]}
[]
[null,null,null,null,null,null,null,null,null,null,null,null,null,null,null,null,"Tipo ","(Vários itens)",null,null,null,null,null,null,null,null,null,null,"ARRASTAR PARA BAIXO!!",null,null,null,"ARRASTAR PARA BAIXO!!"]
["Tipo ","Nome científico","Contagem de Nome científico",null,"Tipo ","Nome científico","Contagem de Nome científico",null,"Tipo ","Nome científico","Contagem de Nome científico",null,"Tipo ","Nome científico","Contagem de Nome científico",null,null,null,null,null,{"$f":"A3","v":"Tipo "},{"$f":"B3","v":"Nome científico"},{"$f":"C3","v":"Contagem de Nome científico"},null,{"$f":"E3","v":"Tipo "},{"$f":"F3","v":"Nome científico"},{"$f":"G3","v":"Contagem de Nome científico"},null,{"$f":"I3","v":"Tipo "},{"$f":"J3","v":"Nome científico"},{"$f":"K3","v":"Contagem de Nome científico"},null,{"$f":"M3","v":"Tipo "},{"$f":"N3","v":"Nome científico"},{"$f":"O3","v":"Contagem de Nome científico"}]
["AF","Calitrix pericilatta",1,null,null,null,null,null,"AT","Dasypus novemcinctus",1,null,"RE","Apodemus sylvaticus",1,null,"Nome científico","Contagem de Nome científico",null,null,"AF","Calitrix pericilatta",1,null,0,0,0,null,"AT","Dasypus novemcinctus",1,null,"RE","Apodemus sylvaticus",1]
["AF","Dasypus novemcinctus",1,null,null,null,null,null,"AT","Didelphis albiventris",1,null,"RE","Copeoglossum nigropunctatum",1,null,"Apodemus sylvaticus",1,null,null,"AF","Dasypus novemcinctus",1,null,0,0,0,null,"AT","Didelphis albiventris",1,null,"RE","Copeoglossum nigropunctatum",1]
["AF","Salvator merianae",1,null,null,null,null,null,"AT","Didelphis aurita",1,null,"RE","Crotalus durissus",8,null,"Copeoglossum nigropunctatum",1,null,null,"AF","Salvator merianae",1,null,0,0,0,null,"AT","Didelphis aurita",1,null,"RE","Crotalus durissus",8]
{"$rows_left_out":64}
{"sheet":"Graf_2b","index":12,"n_rows":28,"n_cols":4,"rows_kept":28,"cut":false,"hidden":false,"merged":[]}
[null,null,"Resgastes","Atropelados"]
[{"$f":"Graf_2!Q2","v":"Tipo "},{"$f":"Graf_2!R2","v":"(Vários itens)"}]
[{"$f":"Graf_2!Q4","v":"Nome científico"},{"$f":"Graf_2!R4","v":"Contagem de Nome científico"},"RE","AT"]
[{"$f":"Graf_2!Q11","v":"Dipsas mikanii"},{"$f":"Graf_2!R11","v":7},{"$f":"IFERROR(VLOOKUP(A4,Graf_2!$AH$4:$AI$1048576,2,FALSE),0)","v":5},{"$f":"IFERROR(VLOOKUP(A4,Graf_2!$AD$4:$AE$1048576,2,FALSE),0)","v":2}]
[{"$f":"Graf_2!Q14","v":"Oxyrhopus guibei"},{"$f":"Graf_2!R14","v":4},{"$f":"IFERROR(VLOOKUP(A5,Graf_2!$AH$4:$AI$1048576,2,FALSE),0)","v":1},{"$f":"IFERROR(VLOOKUP(A5,Graf_2!$AD$4:$AE$1048576,2,FALSE),0)","v":3}]
[{"$f":"Graf_2!Q7","v":"Crotalus durissus"},{"$f":"Graf_2!R7","v":8},{"$f":"IFERROR(VLOOKUP(A6,Graf_2!$AH$4:$AI$1048576,2,FALSE),0)","v":8},{"$f":"IFERROR(VLOOKUP(A6,Graf_2!$AD$4:$AE$1048576,2,FALSE),0)","v":0}]
{"$rows_left_out":23}
{"sheet":"Treinamento","index":13,"n_rows":32,"n_cols":6,"rows_kept":32,"cut":false,"hidden":false,"merged":[]}
[]
[null,"Tema","Data","Hora","Público-alvo","Local"]
[null,"Acidentes com animais peçonhentos","2020-11-30","1 Hora",null,"Consórcio BDP"]
[null,"Atropelamento de animais silvestres","2020-11-30","1 Hora","Equipe administrativa","Consórcio BDP"]
[null,"Resgate e Atropelamento de animais silvestres","2020-12-09","1 Hora","Equipe administrativa","Consórcio BDP"]
[null,"Resgate de fauna","2021-01-22","1 Hora","Equipe de plantio","Flora Pantanal"]
{"$rows_left_out":27}
{"sheet":"Quad","index":14,"n_rows":99,"n_cols":38,"rows_kept":99,"cut":false,"hidden":false,"merged":[[72,5,74,5],[72,6,74,6],[72,7,74,7],[72,12,74,12],[73,8,73,9],[73,10,73,11],[4,34,5,34],[1,13,2,13],[72,8,72,11],[1,17,1,18],[1,24,1,25],[1,20,2,20],[1,21,2,21],[1,22,2,22],[1,23,2,23],[69,0,70,0],[1,14,2,14],[1,15,2,15],[1,16,2,16],[50,0,52,0]]}
[null,"Quadro 6 – Treinamentos ministrados no período de 01 de Junho  a 30 de setembro 2020",null,null,null,null,null,null,null,null,null,null,null,"ANEXO 0322–01–AS–RQS–0004.07–PMCF - antigo Quadro 11",null,null,null,null,null,null,"AVISTAMENTOS - Quadro 9 – Registro de avistamento da fauna – 01 de Junho  a 30 de setembro 2020."]
[null,"Tema","Data","Hora","Público alvo","Local",null,null,null,null,null,null,null,"Nome científico","Nome popular","Data","Quantidade","Coordenadas",null,null,"Nome científico","Nome popular","Data","Hora","Coordenadas",null,null,null,null,null,null,null,null,null,"PROGRAMA DE MONITORAMENTO E CONSERVAÇÃO DA FAUNA","Total","1º Quadimestre","2º Quadimestre"]
[null,"Utilização de EPI; Crime ambiental; Autorizações de Manejo","2020-08-11","2 Horas","Colaboradores em geral","Consórcio BDP",null,"Atropelamento de animais silvestres","2020-11-30","1 Hora","Equipe administrativa","Consórcio BDP",null,null,null,null,null,"x","y",null,null,null,null,null,"X","Y",null,null,null,null,null,null,null,null,"Número total de animais resgatados (RE + AT) [Indivíduo/espécie]","43/20","19/10","24/14"]
[null,"Afugentamento e resgate de fauna durante supressão vegetal","2020-08-21","2 Horas","Equipe de supressão e M.A","Consórcio BDP",null,"Resgate e Atropelamento de animais silvestres","2020-12-09","1 Hora","Equipe administrativa","Consórcio BDP",null,null,null,null,null,null,null,null,null,null,null,null,null,null,null,null,null,null,null,null,null,null,"Subprograma de Resgate da Fauna Silvestre"]
[null,"Febre maculosa","2020-08-21","2 Horas","Equipe de supressão e M.A","Consórcio BDP",null,"Acidentes com animais peçonhentos","2020-11-30","1 Hora",null,"Consórcio BDP",null,null,null,null,null,null,null,null,null,null,null,null,null,null,null,null,null,null,null,null,null,null,"Indicador","Status Acumulado","Status do período","Status do período"]
[null,"Atropelamento de animais silvestres","2020-08-21","2 Horas","Equipe de supressão e M.A","Consórcio BDP",null,"Resgate de fauna","2021-01-22","1 Hora","Equipe de plantio","Flora Pantanal",null,null,null,null,null,null,null,null,null,null,null,null,null,null,null,null,null,null,null,null,null,null,null,"Indivíduo / Espécie"," Indivíduo / Espécie"," Indivíduo / Espécie"]
{"$rows_left_out":94}
{"sheet":"Decreto","index":15,"n_rows":1,"n_cols":1,"rows_kept":1,"cut":false,"hidden":false,"merged":[]}
["Decreto nº 63.853, de 27 de novembro de 2018 - Assembleia Legislativa do Estado de São Paulo"]